{"text_format":"1","workbook":"xlsx","n_sheets":3,"sheets":["Calcul des impôts","Part des paroisses","Taux 2015-324- communaux"],"not_rendered":{"charts":0,"images":2,"macros":1,"external_links":0,"defined_names":5,"comments":0,"pivot_tables":0},"unopened":[],"bounds":{"document_bytes":16777216,"sheet_cells":100000,"rows_first":2000,"rows_last":500,"rows_between":2000,"halvings":0,"cell_chars":16384,"cell_head_chars":4096},"cells_cut":0,"cells_raw":0,"read":"whole","date_system":"1900"}

{"sheet":"Calcul des impôts","index":0,"n_rows":151,"n_cols":42,"rows_kept":151,"cut":false,"hidden":false,"merged":[[1,41,7,43],[8,41,21,43],[68,34,68,35],[68,20,68,22],[67,20,67,22],[67,30,67,32],[68,30,68,32],[67,25,67,28],[68,25,68,28],[73,0,73,1],[42,0,42,2],[38,0,38,1],[32,0,32,1],[37,0,37,1],[40,0,40,1],[15,5,15,6],[27,0,28,2],[67,34,67,35],[12,5,12,6],[9,5,9,6],[14,5,14,6],[10,5,10,6],[11,5,11,6]]}
[]
["Steuerberechnung aufgrund des Ergebnisses vor Steuern (Stand per 1.1.2016)",null,null,null,null,null,null,null,null,null,null,null,null,null,null,null,null,null,null,null,null,null,null,null,null,null,null,null,null,null,null,null,null,null,null,null,null,null,null,null,null,"Kurzanleitung:\n1. Rechtsform und Steuertatus der Gesell-\n    chaft angeben.\n2. Ergänzen Sie nach Bedarf die Zahlen 1\n    bis 8 (Alle Zahlen müssen positiv\n    erfasst werden).\n3.  Aufteilung nach Sitzgemeinde sowie\n     Nebensteuerdomizilen in % angeben."]
["—"]
[null,"Kantonaler Steuerfuss 2016:",1,null,null,null,null,null,null,null,null,null,null,null,null,null,null,null,null,null,null,null,{"$f":"SUM(L22+H29+M29+H34+M34+H39+M39+H45+M45+H51+M51+H57+M57+H63+M63+H69+M69)","v":0}]
[]
[null,null,null,null,null,null,null,null,null,null,null,null,null,null,null,null,null,null,null,null,null,null,null,null,null,null,null,null,null,null,"Régimes fiscaux",null,1,"Ordentliche Best."]
[null,"Rechtsform der Gesellschaft",null,null,null,null,1,null,null,null,null,null,null,null,null,null,null,null,null,null,null,null,null,null,null,null,null,null,null,null,null,null,2,"Holding"]
[null,"Steuerstatuts der Gesellschaft",null,null,"Ordinaire",null,1,null,null,null,null,null,null,null,null,null,null,null,null,null,null,null,null,null,null,null,null,null,null,null,null,null,3,"Domizil. Gesel."]
[null,null,null,null,null,null,null,null,null,null,null,null,null,null,null,null,null,null,null,null,null,null,{"$f":"J22+F29+K29+F34+K34+F39+K39+F45+K45+F51+K51+F57+K57+F63+K63+F69+K69","v":0},null,null,null,null,null,null,null,null,null,null,null,null,null,null,null,null,null,null,"Kurzbeschrieb:\nDas vorliegende Modul ermöglicht die\nBerechnung der Steuerrückstellung aufgrund des Reingewinnes vor Steuern.\nEs dient nur zur Berechnung der im Kanton Freiburg und für die DBST geschuldeten Steuern.\nKleinere, unbedeutende Abweichungen können vorkommen. \nDie angegebene Rückstellung hat nur Informationszweck. Diese kann nicht als Beweismittel benutzt werden."]
["1. Total des steuerbaren Kapital (Kanton)",null,null,null,null,null,null,null,null,null,null,null,null,null,null,null,null,null,null,null,null,null,null,null,null,null,null,null,null,null,"Genre de sociétés",null,1,"AG, Genossensch., GmbH"]
["2. Total des steuerbaren Gewinn (vor Verlustverr. und ohne a.o. Gewinne von Vereinen)",null,null,null,null,null,null,"(Betrag vor Steuern)",null,null,null,null,null,null,null,null,null,null,null,null,null,null,null,null,null,null,null,null,null,null,null,null,2,"Vereine, Stiftungen, Andere JP"]
["3. Steuerb, Gewinn Kanton (wenn Unterschied zu demjenigen unter 2) (z.B. CH Vorausanteil Domizilges.)",null,null,null,null,null,null,"(Betrag vor Steuern)"]
["4. Für Vereine und Stiftungen: ausserordentliche Gewinne"]
[]
["5. Verlustverrechnung (gemäss Punk \"H\" der Steuererklärung)",null,null,null,null,null,null,null,null,null,null,null,null,null,null,null,null,null,null,null,null,"No d'ident.","Taux des communes sélectionnés"]
["6. Verrechenbare Verluste (Kanton)",null,null,null,null,null,null,{"$f":"IF(G22=1,\" \",IF(F12<>0,\" \",IF(F12=0,IF(F16<>0,\"Il ne faut pas indiquer de pertes au canton\",\" \"))))","v":" "},null,null,null,null,null,null,null,null,null,null,null,null,null,null,"Communes",null,null,"Paroisses"]
[null,null,null,null,null,null,null,null,null,null,null,null,null,null,null,null,null,null,null,null,null,null,null,null,null,"Catholiques",null,null,"Réformées"]
["7. Ermässigungen jeglicher Art, in %",null,null,null,null,null,"(Beteiligungsabzug, Steuerermässigung, …)"]
["8. Sofern die Steuerpflicht nicht ein Jahr ausmacht; Anzahl der Tage",null,null,null,null,null,null,{"$f":"IF(G22=1,\" \",IF(F12-F16=F11-F15,\"Ne pas indiquer de bénéfice au canton\",\" \"))","v":" "}]
[null,null,null,null,{"$f":"IF(G22=1,\" \",IF(G77<>1,\"Erreur dans la répartition du bénéfice\",\" \"))","v":" "}]
[null,null,null,null,{"$f":"IF(G22=1,\" \",IF(G75<>1,\"Erreur dans la répartition du capital\",\" \"))","v":" "},null,null,null,null,null,null,null,null,null,null,null,null,null,null,null,null,"No de réf.","Capital","Bénéfice","% cath.","Capital","Bénéfice","% réf.","Capital","Bénéfice","Capital réparti","Cote com. cap.",null,"Cote par. cap.","Cote com. bén.","Cote par. cath. bén.","Bénéfice com. réparti","Bén. cath. rép.","Bén. réf. réparti",null,"bénéf réparti"]
[null,"Sitzgemeinde",null,null,null,null,1,null,"In %",null,"In %",null,null,null,null,null,null,null,null,"Commune de domicile",null,{"$f":"IF(G22=1,0,G22)","v":0},{"$f":"IF(V22=0,0,VLOOKUP(V22,'Taux 2015-324- communaux'!$A$14:$H$165,4))","v":0},{"$f":"IF(V22=0,0,VLOOKUP(V22,'Taux 2015-324- communaux'!$A$14:$H$165,4))","v":0},{"$f":"IF(V22=0,0,VLOOKUP(V22,'Part des paroisses'!$A$2:$E$169,4))","v":0},{"$f":"IF(V22=0,0,VLOOKUP(V22,'Taux 2015-324- communaux'!$A$14:$H$165,6))","v":0},{"$f":"IF(V22=0,0,VLOOKUP(V22,'Taux 2015-324- communaux'!$A$14:$H$165,5))","v":0},{"$f":"IF(V22=0,0,VLOOKUP(V22,'Part des paroisses'!$A$2:$E$169,5))","v":0},{"$f":"IF(V22=0,0,VLOOKUP(V22,'Taux 2015-324- communaux'!$A$14:$H$165,8))","v":0},{"$f":"IF(V22=0,0,VLOOKUP(V22,'Taux 2015-324- communaux'!$A$14:$H$165,7))","v":0},{"$f":"J22","v":0},{"$f":"ROUND(($X$106*AE22*W22)/100,0)","v":0},null,{"$f":"ROUND(((($X$106*AE22)*(Y22*Z22)/10000)+(($X$106*AE22)*(AB22*AC22))/10000),1)","v":0},{"$f":"ROUND(($X$124*AO22*W22)/100,0)","v":0},{"$f":"ROUND(((($X$124*AO22)*(Y22*AA22)/10000)+(($X$124*AO22)*(AB22*AD22))/10000),1)","v":0},{"$f":"X22*AE22/100","v":0},{"$f":"Y22*AA22*AE22/10000","v":0},{"$f":"AB22*AD22*AE22/10000","v":0},null,{"$f":"L22","v":0}]
[null,null,null,null,null,null,null,null,"Kapital",{"$f":"F10*J22","v":0},"Gewinn",{"$f":"IF(($F$12-$F$16)>0,($F$12-$F$16)*L22,IF($F$12=0,$F$11*L22,0))","v":0},null,null,null,null,null,null,null,"Communes de répart.",null,{"$f":"IF(G27=1,0,G27)","v":0},{"$f":"IF(V23=0,0,VLOOKUP(V23,'Taux 2015-324- communaux'!$A$14:$H$165,4))","v":0},{"$f":"IF(V23=0,0,VLOOKUP(V23,'Taux 2015-324- communaux'!$A$14:$H$165,4))","v":0},{"$f":"IF(V23=0,0,VLOOKUP(V23,'Part des paroisses'!$A$2:$E$169,4))","v":0},{"$f":"IF(V23=0,0,VLOOKUP(V23,'Taux 2015-324- communaux'!$A$14:$H$165,6))","v":0},{"$f":"IF(V23=0,0,VLOOKUP(V23,'Taux 2015-324- communaux'!$A$14:$H$165,5))","v":0},{"$f":"IF(V23=0,0,VLOOKUP(V23,'Part des paroisses'!$A$2:$E$169,5))","v":0},{"$f":"IF(V23=0,0,VLOOKUP(V23,'Taux 2015-324- communaux'!$A$14:$H$165,8))","v":0},{"$f":"IF(V23=0,0,VLOOKUP(V23,'Taux 2015-324- communaux'!$A$14:$H$165,7))","v":0},{"$f":"F29","v":0},{"$f":"ROUND(($X$106*AE23*W23)/100,0)","v":0},null,{"$f":"ROUND(((($X$106*AE23)*(Y23*Z23)/10000)+(($X$106*AE23)*(AB23*AC23))/10000),1)","v":0},{"$f":"ROUND(($X$124*AO23*W23)/100,0)","v":0},{"$f":"ROUND(((($X$124*AO23)*(Y23*AA23)/10000)+(($X$124*AO23)*(AB23*AD23))/10000),1)","v":0},{"$f":"X23*AE23/100","v":0},{"$f":"Y23*AA23*AE23/10000","v":0},{"$f":"AB23*AD23*AE23/10000","v":0},null,{"$f":"H29","v":0}]
[null,null,null,null,null,null,null,null,null,null,null,null,null,null,null,null,null,null,null,null,null,{"$f":"IF(L27=1,0,L27)","v":0},{"$f":"IF(V24=0,0,VLOOKUP(V24,'Taux 2015-324- communaux'!$A$14:$H$165,4))","v":0},{"$f":"IF(V24=0,0,VLOOKUP(V24,'Taux 2015-324- communaux'!$A$14:$H$165,4))","v":0},{"$f":"IF(V24=0,0,VLOOKUP(V24,'Part des paroisses'!$A$2:$E$169,4))","v":0},{"$f":"IF(V24=0,0,VLOOKUP(V24,'Taux 2015-324- communaux'!$A$14:$H$165,6))","v":0},{"$f":"IF(V24=0,0,VLOOKUP(V24,'Taux 2015-324- communaux'!$A$14:$H$165,5))","v":0},{"$f":"IF(V24=0,0,VLOOKUP(V24,'Part des paroisses'!$A$2:$E$169,5))","v":0},{"$f":"IF(V24=0,0,VLOOKUP(V24,'Taux 2015-324- communaux'!$A$14:$H$165,8))","v":0},{"$f":"IF(V24=0,0,VLOOKUP(V24,'Taux 2015-324- communaux'!$A$14:$H$165,7))","v":0},{"$f":"K29","v":0},0,null,0,{"$f":"ROUND(($X$124*AO24*W24)/100,0)","v":0},0,0,0,0,null,{"$f":"M29","v":0}]
[null,null,null,null,null,null,null,null,null,null,null,null,null,null,null,null,null,null,null,null,null,{"$f":"IF(G32=1,0,G32)","v":0},{"$f":"IF(V25=0,0,VLOOKUP(V25,'Taux 2015-324- communaux'!$A$14:$H$165,4))","v":0},{"$f":"IF(V25=0,0,VLOOKUP(V25,'Taux 2015-324- communaux'!$A$14:$H$165,4))","v":0},{"$f":"IF(V25=0,0,VLOOKUP(V25,'Part des paroisses'!$A$2:$E$169,4))","v":0},{"$f":"IF(V25=0,0,VLOOKUP(V25,'Taux 2015-324- communaux'!$A$14:$H$165,6))","v":0},{"$f":"IF(V25=0,0,VLOOKUP(V25,'Taux 2015-324- communaux'!$A$14:$H$165,5))","v":0},{"$f":"IF(V25=0,0,VLOOKUP(V25,'Part des paroisses'!$A$2:$E$169,5))","v":0},{"$f":"IF(V25=0,0,VLOOKUP(V25,'Taux 2015-324- communaux'!$A$14:$H$165,8))","v":0},{"$f":"IF(V25=0,0,VLOOKUP(V25,'Taux 2015-324- communaux'!$A$14:$H$165,7))","v":0},{"$f":"F34","v":0},0,null,0,{"$f":"ROUND(($X$124*AO25*W25)/100,0)","v":0},0,0,0,0,null,{"$f":"H34","v":0}]
[null,"Aufteilung nach Gemeinden",null,null,null,null,null,null,null,null,null,null,null,null,null,null,null,null,null,null,null,{"$f":"IF(L32=1,0,L32)","v":0},{"$f":"IF(V26=0,0,VLOOKUP(V26,'Taux 2015-324- communaux'!$A$14:$H$165,4))","v":0},{"$f":"IF(V26=0,0,VLOOKUP(V26,'Taux 2015-324- communaux'!$A$14:$H$165,4))","v":0},{"$f":"IF(V26=0,0,VLOOKUP(V26,'Part des paroisses'!$A$2:$E$169,4))","v":0},{"$f":"IF(V26=0,0,VLOOKUP(V26,'Taux 2015-324- communaux'!$A$14:$H$165,6))","v":0},{"$f":"IF(V26=0,0,VLOOKUP(V26,'Taux 2015-324- communaux'!$A$14:$H$165,5))","v":0},{"$f":"IF(V26=0,0,VLOOKUP(V26,'Part des paroisses'!$A$2:$E$169,5))","v":0},{"$f":"IF(V26=0,0,VLOOKUP(V26,'Taux 2015-324- communaux'!$A$14:$H$165,8))","v":0},{"$f":"IF(V26=0,0,VLOOKUP(V26,'Taux 2015-324- communaux'!$A$14:$H$165,7))","v":0},{"$f":"K34","v":0},0,null,0,0,0,0,0,0,null,{"$f":"M34","v":0}]
[null,null,null,null,null,null,1,null,null,null,null,1,null,null,null,null,null,null,null,null,null,{"$f":"IF(G37=1,0,G37)","v":0},{"$f":"IF(V27=0,0,VLOOKUP(V27,'Taux 2015-324- communaux'!$A$14:$H$165,4))","v":0},{"$f":"IF(V27=0,0,VLOOKUP(V27,'Taux 2015-324- communaux'!$A$14:$H$165,4))","v":0},{"$f":"IF(V27=0,0,VLOOKUP(V27,'Part des paroisses'!$A$2:$E$169,4))","v":0},{"$f":"IF(V27=0,0,VLOOKUP(V27,'Taux 2015-324- communaux'!$A$14:$H$165,6))","v":0},{"$f":"IF(V27=0,0,VLOOKUP(V27,'Taux 2015-324- communaux'!$A$14:$H$165,5))","v":0},{"$f":"IF(V27=0,0,VLOOKUP(V27,'Part des paroisses'!$A$2:$E$169,5))","v":0},{"$f":"IF(V27=0,0,VLOOKUP(V27,'Taux 2015-324- communaux'!$A$14:$H$165,8))","v":0},{"$f":"IF(V27=0,0,VLOOKUP(V27,'Taux 2015-324- communaux'!$A$14:$H$165,7))","v":0},{"$f":"F39","v":0},0,null,0,0,0,0,0,0,null,{"$f":"H39","v":0}]
["Berechnung Steuerbetrag mit Berücksichtigung der Steuerbelastung",null,null,null,null,null,null,null,null,null,null,null,null,null,null,null,null,null,null,null,null,{"$f":"IF(L37=1,0,L37)","v":0},{"$f":"IF(V28=0,0,VLOOKUP(V28,'Taux 2015-324- communaux'!$A$14:$H$165,4))","v":0},{"$f":"IF(V28=0,0,VLOOKUP(V28,'Taux 2015-324- communaux'!$A$14:$H$165,4))","v":0},{"$f":"IF(V28=0,0,VLOOKUP(V28,'Part des paroisses'!$A$2:$E$169,4))","v":0},{"$f":"IF(V28=0,0,VLOOKUP(V28,'Taux 2015-324- communaux'!$A$14:$H$165,6))","v":0},{"$f":"IF(V28=0,0,VLOOKUP(V28,'Taux 2015-324- communaux'!$A$14:$H$165,5))","v":0},{"$f":"IF(V28=0,0,VLOOKUP(V28,'Part des paroisses'!$A$2:$E$169,5))","v":0},{"$f":"IF(V28=0,0,VLOOKUP(V28,'Taux 2015-324- communaux'!$A$14:$H$165,8))","v":0},{"$f":"IF(V28=0,0,VLOOKUP(V28,'Taux 2015-324- communaux'!$A$14:$H$165,7))","v":0},{"$f":"K39","v":0},0,null,0,0,0,0,0,0,null,{"$f":"M39","v":0}]
[null,null,null,null,"In %",null,"In %",null,null,"In %",null,"In %",null,null,null,null,null,null,null,null,null,{"$f":"IF(G43=1,0,G43)","v":0},{"$f":"IF(V29=0,0,VLOOKUP(V29,'Taux 2015-324- communaux'!$A$14:$H$165,4))","v":0},{"$f":"IF(V29=0,0,VLOOKUP(V29,'Taux 2015-324- communaux'!$A$14:$H$165,4))","v":0},{"$f":"IF(V29=0,0,VLOOKUP(V29,'Part des paroisses'!$A$2:$E$169,4))","v":0},{"$f":"IF(V29=0,0,VLOOKUP(V29,'Taux 2015-324- communaux'!$A$14:$H$165,6))","v":0},{"$f":"IF(V29=0,0,VLOOKUP(V29,'Taux 2015-324- communaux'!$A$14:$H$165,5))","v":0},{"$f":"IF(V29=0,0,VLOOKUP(V29,'Part des paroisses'!$A$2:$E$169,5))","v":0},{"$f":"IF(V29=0,0,VLOOKUP(V29,'Taux 2015-324- communaux'!$A$14:$H$165,8))","v":0},{"$f":"IF(V29=0,0,VLOOKUP(V29,'Taux 2015-324- communaux'!$A$14:$H$165,7))","v":0},{"$f":"F45","v":0},0,null,0,0,0,0,0,0,null,{"$f":"H45","v":0}]
[null,"Kantonsteuer auf Kapital (inkl. Steuerfuss)",{"$f":"IF(G22=1,0,ROUND((X106*W61),1))","v":0},null,"Kapital",{"$f":"F10*F29","v":0},"Gewinn",{"$f":"IF(($F$12-$F$16)>0,($F$12-$F$16)*H29,IF($F$12=0,$F$11*H29,0))","v":0},null,"Kapital",{"$f":"F11*K29","v":0},"Gewinn",{"$f":"IF(($F$12-$F$16)>0,($F$12-$F$16)*M29,IF($F$12=0,$F$11*M29,0))","v":0},null,null,null,null,null,null,null,null,{"$f":"IF(L43=1,0,L43)","v":0},{"$f":"IF(V30=0,0,VLOOKUP(V30,'Taux 2015-324- communaux'!$A$14:$H$165,4))","v":0},{"$f":"IF(V30=0,0,VLOOKUP(V30,'Taux 2015-324- communaux'!$A$14:$H$165,4))","v":0},{"$f":"IF(V30=0,0,VLOOKUP(V30,'Part des paroisses'!$A$2:$E$169,4))","v":0},{"$f":"IF(V30=0,0,VLOOKUP(V30,'Taux 2015-324- communaux'!$A$14:$H$165,6))","v":0},{"$f":"IF(V30=0,0,VLOOKUP(V30,'Taux 2015-324- communaux'!$A$14:$H$165,5))","v":0},{"$f":"IF(V30=0,0,VLOOKUP(V30,'Part des paroisses'!$A$2:$E$169,5))","v":0},{"$f":"IF(V30=0,0,VLOOKUP(V30,'Taux 2015-324- communaux'!$A$14:$H$165,8))","v":0},{"$f":"IF(V30=0,0,VLOOKUP(V30,'Taux 2015-324- communaux'!$A$14:$H$165,7))","v":0},{"$f":"K45","v":0},0,null,0,0,0,0,0,0,null,{"$f":"M45","v":0}]
{"$rows_left_out":122}
{"sheet":"Part des paroisses","index":1,"n_rows":178,"n_cols":5,"rows_kept":178,"cut":false,"hidden":false,"merged":[]}
[1]
[2,301,"Alterswil",81.347999999999999,18.652000000000001]
[3,201,"Arconciel",91.992999999999995,8.0069999999999997]
[4,801,"Attalens",76.13,23.87]
[5,601,"Auboranges",80.741,19.259]
[6,202,"Autafond",84.81,15.19]
[7,203,"Autigny",93.090999999999994,6.9089999999999998]
[8,204,"Avry",87.522000000000006,12.478]
[9,403,"Barberêche",80,20]
[10,442,"Bas-Intyamon",95.238,4.7619999999999996]
[11,540,"Bas-Vully",37.186,62.814]
[12,205,"Belfaux",91.328000000000003,8.6720000000000006]
[13,603,"Billens-Hennens",92.11,7.89]
[14,302,"Bösingen",61.360999999999997,38.639000000000003]
[15,803,"Bossonnens",78.271000000000001,21.728999999999999]
[16,403,"Botterens",91.379000000000005,8.6210000000000004]
[17,404,"Broc",95.08,4.92]
[18,303,"Brünisried",82.409000000000006,17.591000000000001]
[19,504,"Büchslen",10.317,89.683000000000007]
[20,405,"Bulle",93.004000000000005,6.9960000000000004]
[21,704,"Bussy",88.186000000000007,11.814]
[22,406,"Cerniat",96.203000000000003,3.7970000000000002]
[23,705,"Châbles",76.600999999999999,23.399000000000001]
[24,606,"Chapelle",73.62,26.38]
[25,407,"Charmey",93.731999999999999,6.2679999999999998]
[26,805,"Châtel-St-Denis",85.963999999999999,14.036]
[27,408,"Châtel-sur-Montsalvens",87.096999999999994,12.903]
[28,708,"Châtillon",76.522000000000006,23.478000000000002]
[29,608,"Châtonnaye",82.664000000000001,17.335999999999999]
[30,709,"Cheiry",78.546999999999997,21.452999999999999]
{"$rows_left_out":149}
{"sheet":"Taux 2015-324- communaux","index":2,"n_rows":168,"n_cols":8,"rows_kept":168,"cut":false,"hidden":false,"merged":[]}
[null,null,"Coefficients des impôts communaux, état au 1er janvier 2016"]
[null,null,"Gemeindesteuerfüsse, Stand am 1. Januar 2016"]
[null,null,"T18-23","Personnes morales"]
[null,null,null,"Impôt sur le bénéfice"]
[null,null,null,"et le capital, en % de","cath.",null,"réf."]
[null,null,null,"l'impôt cantonal de base","Personnes morales",null,"Personnes morales"]
[null,null,null,null,"Juristische Personen",null,"Juristische Personen"]
[null,null,null,"Juristische Personen","Impôt sur le","Impôt sur le","Impôt sur le","Impôt sur le"]
[null,null,null,"Steuer auf dem Gewinn","bénéfice","capital","bénéfice","capital"]
[null,null,null,"und Kapital, in % der","Steuer auf dem","Steuer auf dem","Steuer auf dem","Steuer auf dem"]
[null,null,null,"einfachen Kantonssteuer","Gewinn","Kapital","Gewinn","Kapital"]
[]
[null,"No de la commune"]
[1]
[2,301,"Alterswil",79,10,10,10,10]
[3,201,"Arconciel",85,9,9,10,10]
[4,801,"Attalens",78.5,8,8,10,10]
[5,601,"Auboranges",50,10,10,10,10]
[6,203,"Autigny",90,10,10,10,10]
[7,204,"Avry",72.099999999999994,8,10,10,10]
[8,503,"Barberêche",90,10,10,10,10]
[9,442,"Bas-Intymon",83.2,10,10,9,10]
[10,205,"Belfaux",81,8,10,10,10]
[11,753,"Belmont-Broye",72,6,6,8,10]
[12,603,"Billens-Hennens",100,10,10,10,10]
[13,302,"Bösingen",79,10,10,10,10]
[14,803,"Bossonnens",93,8,8,10,10]
[15,403,"Botterens",85,10,10,9,10]
[16,404,"Broc",92,10,10,9,10]
[17,303,"Brünisried",95,10,10,10,10]
{"$rows_left_out":138}